Logs

The following logs have been generated by the jobs in this plan.
  • Expand all
  • Collapse all
Job Logs
Collapse Default Job Default Stage Download or View
24-Nov-2020 13:42:32 [INFO] --- maven-resources-plugin:3.2.0:resources (default-resources) @ delivery ---
24-Nov-2020 13:42:33 [INFO] Using 'UTF-8' encoding to copy filtered resources.
24-Nov-2020 13:42:33 [INFO] Using 'UTF-8' encoding to copy filtered properties files.
24-Nov-2020 13:42:33 [INFO] Copying 2 resources
24-Nov-2020 13:42:33 [INFO] Copying 90 resources
24-Nov-2020 13:42:33 [INFO] The encoding used to copy filtered properties files have not been set. This means that the same encoding will be used to copy filtered properties files as when copying other filtered resources. This might not be what you want! Run your build with --debug to see which files might be affected. Read more at https://maven.apache.org/plugins/maven-resources-plugin/examples/filtering-properties-files.html
24-Nov-2020 13:42:33 [INFO]
24-Nov-2020 13:42:33 [INFO] --- maven-compiler-plugin:3.8.1:compile (default-compile) @ delivery ---
24-Nov-2020 13:42:33 [INFO] Changes detected - recompiling the module!
24-Nov-2020 13:42:33 [INFO] Compiling 153 source files to /data/atlassian/bamboo/xml-data/build-dir/DELIVERY-PRODUCTION-JOB1/target/classes
24-Nov-2020 13:42:33 [INFO] ------------------------------------------------------------------------
24-Nov-2020 13:42:33 [INFO] BUILD FAILURE
24-Nov-2020 13:42:33 [INFO] ------------------------------------------------------------------------
24-Nov-2020 13:42:33 [INFO] Total time: 2.545 s
24-Nov-2020 13:42:33 [INFO] Finished at: 2020-11-24T13:42:33+01:00
24-Nov-2020 13:42:33 [INFO] Final Memory: 20M/149M
24-Nov-2020 13:42:33 [INFO] ------------------------------------------------------------------------
24-Nov-2020 13:42:33 [ERROR] Failed to execute goal org.apache.maven.plugins:maven-compiler-plugin:3.8.1:compile (default-compile) on project delivery: Fatal error compiling: invalid target release: 11 -> [Help 1]
24-Nov-2020 13:42:33 [ERROR]
24-Nov-2020 13:42:33 [ERROR] To see the full stack trace of the errors, re-run Maven with the -e switch.
24-Nov-2020 13:42:33 [ERROR] Re-run Maven using the -X switch to enable full debug logging.
24-Nov-2020 13:42:33 [ERROR]
24-Nov-2020 13:42:33 [ERROR] For more information about the errors and possible solutions, please read the following articles:
24-Nov-2020 13:42:33 [ERROR] [Help 1] http://cwiki.apache.org/confluence/display/MAVEN/MojoExecutionException
24-Nov-2020 13:42:33 Unable to publish artifact [4.0]: