Build result summary

Details

Completed
Duration
2 minutes
Labels
None
Agent
Default Agent
Revision
a48e19365675441784c0452202df546d4b52b53c a48e19365675441784c0452202df546d4b52b53c
Total tests
15
Fixed in
#76 (Changes by kerim1 <kerim1@users.noreply.github.com>)

Responsible

No one has taken responsibility for this failure

Code commits

Author Commit Message Commit date
kerim1 &lt;kerim1@users.noreply.github.com&gt; kerim1 <kerim1@users.noreply.github.com> a48e19365675441784c0452202df546d4b52b53c a48e19365675441784c0452202df546d4b52b53c Add new fields for the Archivematica workflow

Tests

New test failures 9
Status Test View job Duration
Collapse Failed CollectionSearchSpec testDigitalMaterialSearch History
Default Job < 1 sec
junit.framework.AssertionFailedError: Assertion failed: 

assert collections1.size() == 2
       |            |      |
       []           0      false

	at org.iish.acquisition.search.CollectionSearchSpec.testDigitalMaterialSearch(CollectionSearchSpec.groovy:222)
Collapse Failed CollectionSearchSpec testDateRangeSearch History
Default Job < 1 sec
junit.framework.AssertionFailedError: Assertion failed: 

assert collections1.size() == 3
       |            |      |
       []           0      false

	at org.iish.acquisition.search.CollectionSearchSpec.testDateRangeSearch(CollectionSearchSpec.groovy:99)
Collapse Failed CollectionSearchSpec testCollectionNameSearch History
Default Job < 1 sec
junit.framework.AssertionFailedError: Assertion failed: 

assert collections1.size() == 2
       |            |      |
       []           0      false

	at org.iish.acquisition.search.CollectionSearchSpec.testCollectionNameSearch(CollectionSearchSpec.groovy:31)
Collapse Failed CollectionSearchSpec testSortSearch History
Default Job < 1 sec
junit.framework.AssertionFailedError: Assertion failed: 

assert collections1.size() == 5
       |            |      |
       [Fourth]     1      false

	at org.iish.acquisition.search.CollectionSearchSpec.testSortSearch(CollectionSearchSpec.groovy:253)
Collapse Failed CollectionSearchSpec testStatusSearch History
Default Job < 1 sec
junit.framework.AssertionFailedError: Assertion failed: 

assert collections1.size() == 4
       |            |      |
       [Fourth]     1      false

	at org.iish.acquisition.search.CollectionSearchSpec.testStatusSearch(CollectionSearchSpec.groovy:164)
Collapse Failed CollectionSearchSpec testContactPersonSearch History
Default Job < 1 sec
org.springframework.orm.hibernate4.HibernateSystemException: instance was not in a valid state; nested exception is org.hibernate.HibernateException: instance was not in a valid state
	at org.iish.acquisition.search.CollectionSearchImpl.getResultsFor(CollectionSearchImpl.groovy:72)
	at org.iish.acquisition.search.CollectionSearchDecorator.getResultsFor(CollectionSearchDecorator.groovy:64)
	at org.iish.acquisition.search.AbstractCollectionSearch.getResults(AbstractCollectionSearch.groovy:19)
	at org.iish.acquisition.search.CollectionSearchSpec.testContactPersonSearch(CollectionSearchSpec.groovy:131)
Caused by: org.hibernate.HibernateException: instance was not in a valid state
	at org.iish.acquisition.domain.Collection.afterInsertOrUpdate(Collection.groovy:162)
	at org.iish.acquisition.domain.DigitalMaterialCollection.afterInsert(DigitalMaterialCollection.groovy:41)
(3 more lines...)
Collapse Failed CollectionSearchSpec testCombinationSearch History
Default Job < 1 sec
junit.framework.AssertionFailedError: Assertion failed: 

assert collections1.size() == 2
       |            |      |
       []           0      false

	at org.iish.acquisition.search.CollectionSearchSpec.testCombinationSearch(CollectionSearchSpec.groovy:313)
Collapse Failed CollectionSearchSpec testAnalogMaterialSearch History
Default Job < 1 sec
junit.framework.AssertionFailedError: Assertion failed: 

assert collections1.size() == 2
       |            |      |
       []           0      false

	at org.iish.acquisition.search.CollectionSearchSpec.testAnalogMaterialSearch(CollectionSearchSpec.groovy:194)
Collapse Failed CollectionSearchSpec testLocationSearch History
Default Job < 1 sec
junit.framework.AssertionFailedError: Assertion failed: 

assert collections1.size() == 2
       |            |      |
       []           0      false

	at org.iish.acquisition.search.CollectionSearchSpec.testLocationSearch(CollectionSearchSpec.groovy:61)