Build: #30 failed Changes by kerim1 <kerim.meijer@gmail.com>

Build result summary

Details

Completed
Duration
2 minutes
Labels
None
Agent
Default Agent
Revision
b1cf80fd8d16e3ffcb4f1f8befc85fef0a9b476f b1cf80fd8d16e3ffcb4f1f8befc85fef0a9b476f
Total tests
15
Fixed in
#31 (Changes by kerim1 <kerim.meijer@gmail.com>)

Responsible

No one has taken responsibility for this failure

Code commits

Author Commit Message Commit date
kerim1 &lt;kerim.meijer@gmail.com&gt; kerim1 <kerim.meijer@gmail.com> b1cf80fd8d16e3ffcb4f1f8befc85fef0a9b476f b1cf80fd8d16e3ffcb4f1f8befc85fef0a9b476f dbCreate is back to 'validate'
kerim1 &lt;kerim.meijer@gmail.com&gt; kerim1 <kerim.meijer@gmail.com> 2b1d256e9817e3a63fde7932e39092768e1d4263 2b1d256e9817e3a63fde7932e39092768e1d4263 Changed label from 'photo' to 'document' and made 'contract' a required field

Tests

New test failures 12
Status Test View job Duration
Collapse Failed DigitalMaterialStatusSpec testWithoutFolder History
Default Job < 1 sec
org.springframework.dao.DataIntegrityViolationException: Hibernate operation: could not execute statement; SQL [n/a]; NULL not allowed for column "CONTRACT_ID"; SQL statement:
insert into collections (id, accrual, acquisition_id, acquisition_type_id, added_by_id, appraisal_id, collection_level_ready, contact_person, content, contract_id, date_created, date_of_arrival, deleted, level, lists_available, name, object_repository_pid, original_package_transport, owner, priority, remarks, status_id, to_be_done) values (null, ?, ?, ?, ?, ?, ?, ?, ?, ?, ?, ?, ?, ?, ?, ?, ?, ?, ?, ?, ?, ?, ?) [23502-173]; nested exception is org.h2.jdbc.JdbcSQLException: NULL not allowed for column "CONTRACT_ID"; SQL statement:
insert into collections (id, accrual, acquisition_id, acquisition_type_id, added_by_id, appraisal_id, collection_level_ready, contact_person, content, contract_id, date_created, date_of_arrival, deleted, level, lists_available, name, object_repository_pid, original_package_transport, owner, priority, remarks, status_id, to_be_done) values (null, ?, ?, ?, ?, ?, ?, ?, ?, ?, ?, ?, ?, ?, ?, ?, ?, ?, ?, ?, ?, ?, ?) [23502-173]
	at org.iish.acquisition.domain.DigitalMaterialStatusSpec.setUp1(DigitalMaterialStatusSpec.groovy:135)
	at org.iish.acquisition.domain.DigitalMaterialStatusSpec.testWithoutFolder(DigitalMaterialStatusSpec.groovy:12)
Caused by: org.h2.jdbc.JdbcSQLException: NULL not allowed for column "CONTRACT_ID"; SQL statement:
insert into collections (id, accrual, acquisition_id, acquisition_type_id, added_by_id, appraisal_id, collection_level_ready, contact_person, content, contract_id, date_created, date_of_arrival, deleted, level, lists_available, name, object_repository_pid, original_package_transport, owner, priority, remarks, status_id, to_be_done) values (null, ?, ?, ?, ?, ?, ?, ?, ?, ?, ?, ?, ?, ?, ?, ?, ?, ?, ?, ?, ?, ?, ?) [23502-173]
	at org.h2.message.DbException.getJdbcSQLException(DbException.java:331)
(10 more lines...)
Collapse Failed DigitalMaterialStatusSpec testReadyForBackup History
Default Job < 1 sec
org.springframework.dao.DataIntegrityViolationException: Hibernate operation: could not execute statement; SQL [n/a]; NULL not allowed for column "CONTRACT_ID"; SQL statement:
insert into collections (id, accrual, acquisition_id, acquisition_type_id, added_by_id, appraisal_id, collection_level_ready, contact_person, content, contract_id, date_created, date_of_arrival, deleted, level, lists_available, name, object_repository_pid, original_package_transport, owner, priority, remarks, status_id, to_be_done) values (null, ?, ?, ?, ?, ?, ?, ?, ?, ?, ?, ?, ?, ?, ?, ?, ?, ?, ?, ?, ?, ?, ?) [23502-173]; nested exception is org.h2.jdbc.JdbcSQLException: NULL not allowed for column "CONTRACT_ID"; SQL statement:
insert into collections (id, accrual, acquisition_id, acquisition_type_id, added_by_id, appraisal_id, collection_level_ready, contact_person, content, contract_id, date_created, date_of_arrival, deleted, level, lists_available, name, object_repository_pid, original_package_transport, owner, priority, remarks, status_id, to_be_done) values (null, ?, ?, ?, ?, ?, ?, ?, ?, ?, ?, ?, ?, ?, ?, ?, ?, ?, ?, ?, ?, ?, ?) [23502-173]
	at org.iish.acquisition.domain.DigitalMaterialStatusSpec.setUp1(DigitalMaterialStatusSpec.groovy:135)
	at org.iish.acquisition.domain.DigitalMaterialStatusSpec.testReadyForBackup(DigitalMaterialStatusSpec.groovy:47)
Caused by: org.h2.jdbc.JdbcSQLException: NULL not allowed for column "CONTRACT_ID"; SQL statement:
insert into collections (id, accrual, acquisition_id, acquisition_type_id, added_by_id, appraisal_id, collection_level_ready, contact_person, content, contract_id, date_created, date_of_arrival, deleted, level, lists_available, name, object_repository_pid, original_package_transport, owner, priority, remarks, status_id, to_be_done) values (null, ?, ?, ?, ?, ?, ?, ?, ?, ?, ?, ?, ?, ?, ?, ?, ?, ?, ?, ?, ?, ?, ?) [23502-173]
	at org.h2.message.DbException.getJdbcSQLException(DbException.java:331)
(10 more lines...)
Collapse Failed DigitalMaterialStatusSpec testReadyForIngest History
Default Job < 1 sec
org.springframework.dao.DataIntegrityViolationException: Hibernate operation: could not execute statement; SQL [n/a]; NULL not allowed for column "CONTRACT_ID"; SQL statement:
insert into collections (id, accrual, acquisition_id, acquisition_type_id, added_by_id, appraisal_id, collection_level_ready, contact_person, content, contract_id, date_created, date_of_arrival, deleted, level, lists_available, name, object_repository_pid, original_package_transport, owner, priority, remarks, status_id, to_be_done) values (null, ?, ?, ?, ?, ?, ?, ?, ?, ?, ?, ?, ?, ?, ?, ?, ?, ?, ?, ?, ?, ?, ?) [23502-173]; nested exception is org.h2.jdbc.JdbcSQLException: NULL not allowed for column "CONTRACT_ID"; SQL statement:
insert into collections (id, accrual, acquisition_id, acquisition_type_id, added_by_id, appraisal_id, collection_level_ready, contact_person, content, contract_id, date_created, date_of_arrival, deleted, level, lists_available, name, object_repository_pid, original_package_transport, owner, priority, remarks, status_id, to_be_done) values (null, ?, ?, ?, ?, ?, ?, ?, ?, ?, ?, ?, ?, ?, ?, ?, ?, ?, ?, ?, ?, ?, ?) [23502-173]
	at org.iish.acquisition.domain.DigitalMaterialStatusSpec.setUp1(DigitalMaterialStatusSpec.groovy:135)
	at org.iish.acquisition.domain.DigitalMaterialStatusSpec.testReadyForIngest(DigitalMaterialStatusSpec.groovy:80)
Caused by: org.h2.jdbc.JdbcSQLException: NULL not allowed for column "CONTRACT_ID"; SQL statement:
insert into collections (id, accrual, acquisition_id, acquisition_type_id, added_by_id, appraisal_id, collection_level_ready, contact_person, content, contract_id, date_created, date_of_arrival, deleted, level, lists_available, name, object_repository_pid, original_package_transport, owner, priority, remarks, status_id, to_be_done) values (null, ?, ?, ?, ?, ?, ?, ?, ?, ?, ?, ?, ?, ?, ?, ?, ?, ?, ?, ?, ?, ?, ?) [23502-173]
	at org.h2.message.DbException.getJdbcSQLException(DbException.java:331)
(10 more lines...)
Collapse Failed CollectionSearchSpec testStatusSearch History
Default Job < 1 sec
junit.framework.AssertionFailedError: Assertion failed: 

assert collections1.size() == 4
       |            |      |
       []           0      false

	at org.iish.acquisition.search.CollectionSearchSpec.testStatusSearch(CollectionSearchSpec.groovy:164)
Collapse Failed CollectionSearchSpec testContactPersonSearch History
Default Job < 1 sec
junit.framework.AssertionFailedError: Assertion failed: 

assert collections1.size() == 2
       |            |      |
       []           0      false

	at org.iish.acquisition.search.CollectionSearchSpec.testContactPersonSearch(CollectionSearchSpec.groovy:133)
Collapse Failed CollectionSearchSpec testLocationSearch History
Default Job < 1 sec
junit.framework.AssertionFailedError: Assertion failed: 

assert collections1.size() == 2
       |            |      |
       []           0      false

	at org.iish.acquisition.search.CollectionSearchSpec.testLocationSearch(CollectionSearchSpec.groovy:61)
Collapse Failed CollectionSearchSpec testDateRangeSearch History
Default Job < 1 sec
junit.framework.AssertionFailedError: Assertion failed: 

assert collections1.size() == 3
       |            |      |
       []           0      false

	at org.iish.acquisition.search.CollectionSearchSpec.testDateRangeSearch(CollectionSearchSpec.groovy:99)
Collapse Failed CollectionSearchSpec testCollectionNameSearch History
Default Job < 1 sec
junit.framework.AssertionFailedError: Assertion failed: 

assert collections1.size() == 2
       |            |      |
       []           0      false

	at org.iish.acquisition.search.CollectionSearchSpec.testCollectionNameSearch(CollectionSearchSpec.groovy:31)
Collapse Failed CollectionSearchSpec testCombinationSearch History
Default Job < 1 sec
junit.framework.AssertionFailedError: Assertion failed: 

assert collections1.size() == 2
       |            |      |
       []           0      false

	at org.iish.acquisition.search.CollectionSearchSpec.testCombinationSearch(CollectionSearchSpec.groovy:313)
Collapse Failed CollectionSearchSpec testDigitalMaterialSearch History
Default Job < 1 sec
junit.framework.AssertionFailedError: Assertion failed: 

assert collections1.size() == 2
       |            |      |
       []           0      false

	at org.iish.acquisition.search.CollectionSearchSpec.testDigitalMaterialSearch(CollectionSearchSpec.groovy:222)
Collapse Failed CollectionSearchSpec testAnalogMaterialSearch History
Default Job < 1 sec
junit.framework.AssertionFailedError: Assertion failed: 

assert collections1.size() == 2
       |            |      |
       []           0      false

	at org.iish.acquisition.search.CollectionSearchSpec.testAnalogMaterialSearch(CollectionSearchSpec.groovy:194)
Collapse Failed CollectionSearchSpec testSortSearch History
Default Job < 1 sec
junit.framework.AssertionFailedError: Assertion failed: 

assert collections1.size() == 5
       |            |      |
       []           0      false

	at org.iish.acquisition.search.CollectionSearchSpec.testSortSearch(CollectionSearchSpec.groovy:253)